{"text_format":"1","workbook":"xlsx","n_sheets":6,"sheets":["SOLICITAÇÃO","MEMORIAL DESCRITIVO","Cor - Versões - Cód Barr","PLANO DE ENSAIO (Encaixe)","PLANO DE ENSAIO (Cadeira Alta)","REPASSE "],"not_rendered":{"charts":0,"images":3,"macros":1,"external_links":1,"defined_names":4,"comments":0,"pivot_tables":0},"unopened":[],"bounds":{"document_bytes":16777216,"sheet_cells":100000,"rows_first":2000,"rows_last":500,"rows_between":2000,"halvings":0,"cell_chars":16384,"cell_head_chars":4096},"cells_cut":0,"cells_raw":0,"read":"whole","date_system":"1900"}

{"sheet":"SOLICITAÇÃO","index":0,"n_rows":57,"n_cols":4,"rows_kept":57,"cut":false,"hidden":false,"merged":[[48,1,48,4],[56,3,56,4],[50,3,50,4],[51,3,51,4],[52,3,52,4],[53,3,53,4],[54,3,54,4],[55,3,55,4],[32,2,32,4],[33,2,33,4],[34,2,34,4],[35,2,35,4],[46,2,46,4],[39,1,39,4],[42,3,42,4],[43,2,43,4],[44,2,44,4],[36,3,36,4],[37,2,37,4],[31,2,31,4],[18,2,18,4],[19,2,19,4],[20,2,20,4],[22,1,22,4],[24,2,24,4],[25,2,25,4],[26,2,26,4],[27,2,27,4],[28,2,28,4],[29,2,29,4],[30,2,30,4],[17,2,17,4],[1,1,1,4],[6,1,6,4],[8,2,8,4],[9,2,9,4],[10,2,10,4],[11,2,11,4],[12,2,12,4],[13,2,13,4],[14,2,14,4],[15,2,15,4],[16,2,16,4]]}
[]
[null,"                                \nANÁLISE DE VIABILIDADE - CAC\n                 \n                               "]
[]
[null,"SOLICITAÇÃO:","-"]
[null,"MODELO DE CERTIFICAÇÃO:","-"]
[]
[null,"DADOS DA EMPRESA SOLICITANTE"]
[]
[null,"RAZÃO SOCIAL:","-"]
[null,"NOME FANTASIA:","-"]
[null,"CNPJ:","-"]
[null,"ENDEREÇO:","-"]
[null,"BAIRRO:","-"]
[null,"CEP:","-"]
[null,"CIDADE:","-"]
[null,"ESTADO:","-"]
[null,"E-MAIL:","-"]
[null,"NOME DO CONTATO:","-"]
[null,"TELEFONE: (   )","-"]
[null,"DATA DA SOLICITAÇÃO:","-"]
[null,null,"______________________________________________________________________\nAssinatura (obrigatório)"]
[]
[null,"DADOS DA FÁBRICA"]
[]
[null,"RAZÃO SOCIAL:","-"]
[null,"NOME FANTASIA:","-"]
[null,"CNPJ:","-"]
[null,"ENDEREÇO:","-"]
[null,"BAIRRO:","-"]
[null,"CEP:","-"]
{"$rows_left_out":28}
{"sheet":"MEMORIAL DESCRITIVO","index":1,"n_rows":96,"n_cols":16,"rows_kept":96,"cut":false,"hidden":false,"merged":[[41,2,41,3],[41,6,41,9],[41,12,41,15],[42,2,42,3],[42,6,42,9],[42,12,42,15],[38,2,38,15],[40,2,40,3],[40,6,40,9],[40,12,40,15],[47,12,47,15],[47,7,47,8],[55,3,55,6],[52,9,52,12],[53,9,53,12],[54,9,54,12],[55,9,55,12],[65,2,74,2],[65,11,74,11],[65,12,74,15],[63,2,63,15],[59,2,59,6],[59,8,59,12],[60,2,61,6],[60,8,61,12],[59,14,61,15],[51,2,51,6],[51,8,51,12],[13,8,13,9],[12,8,12,9],[13,14,13,15],[12,14,12,15],[13,11,13,12],[12,11,12,12],[26,2,27,2],[57,2,57,15],[45,2,45,3],[45,6,45,9],[45,12,45,15],[43,2,43,3],[43,6,43,9],[43,12,43,15],[44,2,44,3],[44,6,44,9],[44,12,44,15],[48,7,48,8],[46,7,46,8],[46,2,46,3],[46,12,46,15],[48,2,48,3],[48,12,48,15],[47,2,47,3],[26,14,27,14],[29,2,30,2],[29,5,30,5],[29,8,30,8],[29,11,30,11],[29,14,30,14],[20,2,21,2],[20,5,21,5],[20,8,21,8],[20,11,21,11],[20,14,21,14],[23,2,24,2],[23,5,24,5],[23,8,24,8],[23,11,24,11],[23,14,24,14],[26,5,27,5],[26,8,27,8],[26,11,27,11],[0,2,0,15],[9,5,10,9],[7,5,8,9],[5,2,5,3],[5,5,5,9],[15,2,15,15],[17,2,18,2],[17,5,18,5],[17,8,18,8],[17,11,18,11],[17,14,18,14],[2,2,2,3],[2,5,2,9],[3,2,3,3],[3,5,3,9],[4,2,4,3],[4,5,4,9],[7,11,10,15],[9,2,10,3],[7,2,8,3],[13,2,13,3],[12,2,12,3],[13,5,13,6],[12,5,12,6],[95,11,99,15],[65,3,74,6],[65,8,74,9],[78,3,87,6],[78,8,87,9],[51,14,55,15],[89,2,93,6],[89,8,93,9],[89,11,93,15],[95,2,99,6],[95,8,99,9],[76,2,76,15],[78,2,87,2],[78,11,87,11],[78,12,87,15],[52,3,52,6],[53,3,53,6],[54,3,54,6],[32,2,33,2],[32,5,33,5],[32,8,33,8],[32,11,33,11],[32,14,33,14],[35,2,36,2],[35,5,36,5],[35,8,36,8],[35,11,36,11],[35,14,36,14]]}
[null,null,"IDENTIFICAÇÃO DO MODELO OBJETO DA CERTIFICAÇÃO"]
[]
[null,null,"MODELO:",null,null,"-"]
[null,null,"MARCA:",null,null,"-"]
[null,null,"NOME COMERCIAL:",null,null,"-"]
[null,null,"CÓDIGO DO FABRICANTE:",null,null,"-"]
[]
[null,null,"MODELO DE CERTIFICAÇÃO:",null,null,{"$f":"SOLICITAÇÃO!C5","v":"-"},null,null,null,null,null,"Nota:\n -Modelo 4 deve ser usado somente como opção para fabricantes nacionais que comprovem sua classificação como MPE e/ou para artesãos nacionais.\n- No caso de modelo 4 de certificação o fornecedor deve demonstrar ao OCP qual o critério de rastreabilidade utilizado para o produto."]
[]
[null,null,{"$f":"IF(F8=\"MODELO 4\",\"CRITÉRIO DE RASTRABILIDADE:\",\"\")","v":""}]
[]
[]
[null,null,{"$f":"IF(SOLICITAÇÃO!C5=\"MODELO 1b - LOTE\",\"IDENTIFICAÇÃO LOTE\",\"\")","v":""},null,null,{"$f":"IF(SOLICITAÇÃO!C5=\"MODELO 1b - LOTE\",\"QUANTIDADE DO LOTE\",\"\")","v":""},null,null,{"$f":"IF(SOLICITAÇÃO!C5=\"MODELO 1b - LOTE\",\"N° DO LOTE DE FABRICAÇÃO\",\"\")","v":""},null,null,{"$f":"IF(SOLICITAÇÃO!C5=\"MODELO 1b - LOTE\",\"LI/LPCO/DI/DUIMP\",\"\")","v":""},null,null,{"$f":"IF(SOLICITAÇÃO!C5=\"MODELO 1b - LOTE\",\"N° DO EDITAL\",\"\")","v":""}]
[]
[]
[null,null,"COR/VERSÕES E CÓDIGO DE BARRAS"]
[]
[null,null,1,{"$f":"IF(VLOOKUP(C18,'Cor - Versões - Cód Barr'!$B$3:$D$37,2,0)=0,\"-\",VLOOKUP(C18,'Cor - Versões - Cód Barr'!$B$3:$D$37,2,0))","v":"-"},null,8,{"$f":"IF(VLOOKUP(F18,'Cor - Versões - Cód Barr'!$B$3:$D$37,2,0)=0,\"-\",VLOOKUP(F18,'Cor - Versões - Cód Barr'!$B$3:$D$37,2,0))","v":"-"},null,15,{"$f":"IF(VLOOKUP(I18,'Cor - Versões - Cód Barr'!$B$3:$D$37,2,0)=0,\"-\",VLOOKUP(I18,'Cor - Versões - Cód Barr'!$B$3:$D$37,2,0))","v":"-"},null,22,{"$f":"IF(VLOOKUP(L18,'Cor - Versões - Cód Barr'!$B$3:$D$37,2,0)=0,\"-\",VLOOKUP(L18,'Cor - Versões - Cód Barr'!$B$3:$D$37,2,0))","v":"-"},null,29,{"$f":"IF(VLOOKUP(O18,'Cor - Versões - Cód Barr'!$B$3:$D$37,2,0)=0,\"-\",VLOOKUP(O18,'Cor - Versões - Cód Barr'!$B$3:$D$37,2,0))","v":"-"}]
[null,null,null,{"$f":"IF(VLOOKUP(C18,'Cor - Versões - Cód Barr'!$B$3:$D$37,3,0)=0,\"-\",VLOOKUP(C18,'Cor - Versões - Cód Barr'!$B$3:$D$37,3,0))","v":"-"},null,null,{"$f":"IF(VLOOKUP(F18,'Cor - Versões - Cód Barr'!$B$3:$D$37,3,0)=0,\"-\",VLOOKUP(F18,'Cor - Versões - Cód Barr'!$B$3:$D$37,3,0))","v":"-"},null,null,{"$f":"IF(VLOOKUP(I18,'Cor - Versões - Cód Barr'!$B$3:$D$37,3,0)=0,\"-\",VLOOKUP(I18,'Cor - Versões - Cód Barr'!$B$3:$D$37,3,0))","v":"-"},null,null,{"$f":"IF(VLOOKUP(L18,'Cor - Versões - Cód Barr'!$B$3:$D$37,3,0)=0,\"-\",VLOOKUP(L18,'Cor - Versões - Cód Barr'!$B$3:$D$37,3,0))","v":"-"},null,null,{"$f":"IF(VLOOKUP(O18,'Cor - Versões - Cód Barr'!$B$3:$D$37,3,0)=0,\"-\",VLOOKUP(O18,'Cor - Versões - Cód Barr'!$B$3:$D$37,3,0))","v":"-"}]
[]
[null,null,2,{"$f":"IF(VLOOKUP(C21,'Cor - Versões - Cód Barr'!$B$3:$D$37,2,0)=0,\"-\",VLOOKUP(C21,'Cor - Versões - Cód Barr'!$B$3:$D$37,2,0))","v":"-"},null,9,{"$f":"IF(VLOOKUP(F21,'Cor - Versões - Cód Barr'!$B$3:$D$37,2,0)=0,\"-\",VLOOKUP(F21,'Cor - Versões - Cód Barr'!$B$3:$D$37,2,0))","v":"-"},null,16,{"$f":"IF(VLOOKUP(I21,'Cor - Versões - Cód Barr'!$B$3:$D$37,2,0)=0,\"-\",VLOOKUP(I21,'Cor - Versões - Cód Barr'!$B$3:$D$37,2,0))","v":"-"},null,23,{"$f":"IF(VLOOKUP(L21,'Cor - Versões - Cód Barr'!$B$3:$D$37,2,0)=0,\"-\",VLOOKUP(L21,'Cor - Versões - Cód Barr'!$B$3:$D$37,2,0))","v":"-"},null,30,{"$f":"IF(VLOOKUP(O21,'Cor - Versões - Cód Barr'!$B$3:$D$37,2,0)=0,\"-\",VLOOKUP(O21,'Cor - Versões - Cód Barr'!$B$3:$D$37,2,0))","v":"-"}]
[null,null,null,{"$f":"IF(VLOOKUP(C21,'Cor - Versões - Cód Barr'!$B$3:$D$37,3,0)=0,\"-\",VLOOKUP(C21,'Cor - Versões - Cód Barr'!$B$3:$D$37,3,0))","v":"-"},null,null,{"$f":"IF(VLOOKUP(F21,'Cor - Versões - Cód Barr'!$B$3:$D$37,3,0)=0,\"-\",VLOOKUP(F21,'Cor - Versões - Cód Barr'!$B$3:$D$37,3,0))","v":"-"},null,null,{"$f":"IF(VLOOKUP(I21,'Cor - Versões - Cód Barr'!$B$3:$D$37,3,0)=0,\"-\",VLOOKUP(I21,'Cor - Versões - Cód Barr'!$B$3:$D$37,3,0))","v":"-"},null,null,{"$f":"IF(VLOOKUP(L21,'Cor - Versões - Cód Barr'!$B$3:$D$37,3,0)=0,\"-\",VLOOKUP(L21,'Cor - Versões - Cód Barr'!$B$3:$D$37,3,0))","v":"-"},null,null,{"$f":"IF(VLOOKUP(O21,'Cor - Versões - Cód Barr'!$B$3:$D$37,3,0)=0,\"-\",VLOOKUP(O21,'Cor - Versões - Cód Barr'!$B$3:$D$37,3,0))","v":"-"}]
[]
[null,null,3,{"$f":"IF(VLOOKUP(C24,'Cor - Versões - Cód Barr'!$B$3:$D$37,2,0)=0,\"-\",VLOOKUP(C24,'Cor - Versões - Cód Barr'!$B$3:$D$37,2,0))","v":"-"},null,10,{"$f":"IF(VLOOKUP(F24,'Cor - Versões - Cód Barr'!$B$3:$D$37,2,0)=0,\"-\",VLOOKUP(F24,'Cor - Versões - Cód Barr'!$B$3:$D$37,2,0))","v":"-"},null,17,{"$f":"IF(VLOOKUP(I24,'Cor - Versões - Cód Barr'!$B$3:$D$37,2,0)=0,\"-\",VLOOKUP(I24,'Cor - Versões - Cód Barr'!$B$3:$D$37,2,0))","v":"-"},null,24,{"$f":"IF(VLOOKUP(L24,'Cor - Versões - Cód Barr'!$B$3:$D$37,2,0)=0,\"-\",VLOOKUP(L24,'Cor - Versões - Cód Barr'!$B$3:$D$37,2,0))","v":"-"},null,31,{"$f":"IF(VLOOKUP(O24,'Cor - Versões - Cód Barr'!$B$3:$D$37,2,0)=0,\"-\",VLOOKUP(O24,'Cor - Versões - Cód Barr'!$B$3:$D$37,2,0))","v":"-"}]
[null,null,null,{"$f":"IF(VLOOKUP(C24,'Cor - Versões - Cód Barr'!$B$3:$D$37,3,0)=0,\"-\",VLOOKUP(C24,'Cor - Versões - Cód Barr'!$B$3:$D$37,3,0))","v":"-"},null,null,{"$f":"IF(VLOOKUP(F24,'Cor - Versões - Cód Barr'!$B$3:$D$37,3,0)=0,\"-\",VLOOKUP(F24,'Cor - Versões - Cód Barr'!$B$3:$D$37,3,0))","v":"-"},null,null,{"$f":"IF(VLOOKUP(I24,'Cor - Versões - Cód Barr'!$B$3:$D$37,3,0)=0,\"-\",VLOOKUP(I24,'Cor - Versões - Cód Barr'!$B$3:$D$37,3,0))","v":"-"},null,null,{"$f":"IF(VLOOKUP(L24,'Cor - Versões - Cód Barr'!$B$3:$D$37,3,0)=0,\"-\",VLOOKUP(L24,'Cor - Versões - Cód Barr'!$B$3:$D$37,3,0))","v":"-"},null,null,{"$f":"IF(VLOOKUP(O24,'Cor - Versões - Cód Barr'!$B$3:$D$37,3,0)=0,\"-\",VLOOKUP(O24,'Cor - Versões - Cód Barr'!$B$3:$D$37,3,0))","v":"-"}]
[]
[null,null,4,{"$f":"IF(VLOOKUP(C27,'Cor - Versões - Cód Barr'!$B$3:$D$37,2,0)=0,\"-\",VLOOKUP(C27,'Cor - Versões - Cód Barr'!$B$3:$D$37,2,0))","v":"-"},null,11,{"$f":"IF(VLOOKUP(F27,'Cor - Versões - Cód Barr'!$B$3:$D$37,2,0)=0,\"-\",VLOOKUP(F27,'Cor - Versões - Cód Barr'!$B$3:$D$37,2,0))","v":"-"},null,18,{"$f":"IF(VLOOKUP(I27,'Cor - Versões - Cód Barr'!$B$3:$D$37,2,0)=0,\"-\",VLOOKUP(I27,'Cor - Versões - Cód Barr'!$B$3:$D$37,2,0))","v":"-"},null,25,{"$f":"IF(VLOOKUP(L27,'Cor - Versões - Cód Barr'!$B$3:$D$37,2,0)=0,\"-\",VLOOKUP(L27,'Cor - Versões - Cód Barr'!$B$3:$D$37,2,0))","v":"-"},null,32,{"$f":"IF(VLOOKUP(O27,'Cor - Versões - Cód Barr'!$B$3:$D$37,2,0)=0,\"-\",VLOOKUP(O27,'Cor - Versões - Cód Barr'!$B$3:$D$37,2,0))","v":"-"}]
[null,null,null,{"$f":"IF(VLOOKUP(C27,'Cor - Versões - Cód Barr'!$B$3:$D$37,3,0)=0,\"-\",VLOOKUP(C27,'Cor - Versões - Cód Barr'!$B$3:$D$37,3,0))","v":"-"},null,null,{"$f":"IF(VLOOKUP(F27,'Cor - Versões - Cód Barr'!$B$3:$D$37,3,0)=0,\"-\",VLOOKUP(F27,'Cor - Versões - Cód Barr'!$B$3:$D$37,3,0))","v":"-"},null,null,{"$f":"IF(VLOOKUP(I27,'Cor - Versões - Cód Barr'!$B$3:$D$37,3,0)=0,\"-\",VLOOKUP(I27,'Cor - Versões - Cód Barr'!$B$3:$D$37,3,0))","v":"-"},null,null,{"$f":"IF(VLOOKUP(L27,'Cor - Versões - Cód Barr'!$B$3:$D$37,3,0)=0,\"-\",VLOOKUP(L27,'Cor - Versões - Cód Barr'!$B$3:$D$37,3,0))","v":"-"},null,null,{"$f":"IF(VLOOKUP(O27,'Cor - Versões - Cód Barr'!$B$3:$D$37,3,0)=0,\"-\",VLOOKUP(O27,'Cor - Versões - Cód Barr'!$B$3:$D$37,3,0))","v":"-"}]
[]
[null,null,5,{"$f":"IF(VLOOKUP(C30,'Cor - Versões - Cód Barr'!$B$3:$D$37,2,0)=0,\"-\",VLOOKUP(C30,'Cor - Versões - Cód Barr'!$B$3:$D$37,2,0))","v":"-"},null,12,{"$f":"IF(VLOOKUP(F30,'Cor - Versões - Cód Barr'!$B$3:$D$37,2,0)=0,\"-\",VLOOKUP(F30,'Cor - Versões - Cód Barr'!$B$3:$D$37,2,0))","v":"-"},null,19,{"$f":"IF(VLOOKUP(I30,'Cor - Versões - Cód Barr'!$B$3:$D$37,2,0)=0,\"-\",VLOOKUP(I30,'Cor - Versões - Cód Barr'!$B$3:$D$37,2,0))","v":"-"},null,26,{"$f":"IF(VLOOKUP(L30,'Cor - Versões - Cód Barr'!$B$3:$D$37,2,0)=0,\"-\",VLOOKUP(L30,'Cor - Versões - Cód Barr'!$B$3:$D$37,2,0))","v":"-"},null,33,{"$f":"IF(VLOOKUP(O30,'Cor - Versões - Cód Barr'!$B$3:$D$37,2,0)=0,\"-\",VLOOKUP(O30,'Cor - Versões - Cód Barr'!$B$3:$D$37,2,0))","v":"-"}]
{"$rows_left_out":67}
{"sheet":"Cor - Versões - Cód Barr","index":2,"n_rows":42,"n_cols":4,"rows_kept":42,"cut":false,"hidden":false,"merged":[]}
[]
[null,null,"COR/VERSÕES"," CÓDIGO DE BARRAS"]
[null,1,"-","-"]
[null,2,"-","-"]
[null,3,"-","-"]
[null,4,"-","-"]
[null,5,"-","-"]
[null,6,"-","-"]
[null,7,"-","-"]
[null,8,"-","-"]
[null,9,"-","-"]
[null,10,"-","-"]
[null,11,"-","-"]
[null,12,"-","-"]
[null,13,"-","-"]
[null,14,"-","-"]
[null,15,"-","-"]
[null,16,"-","-"]
[null,17,"-","-"]
[null,18,"-","-"]
[null,19,"-","-"]
[null,20,"-","-"]
[null,21,"-","-"]
[null,22,"-","-"]
[null,23,"-","-"]
[null,24,"-","-"]
[null,25,"-","-"]
[null,26,"-","-"]
[null,27,"-","-"]
[null,28,"-","-"]
{"$rows_left_out":13}
{"sheet":"PLANO DE ENSAIO (Encaixe)","index":3,"n_rows":56,"n_cols":8,"rows_kept":56,"cut":false,"hidden":true,"merged":[[39,7,39,9],[40,7,40,9],[41,7,41,9],[41,1,41,2],[41,4,41,6],[42,1,42,2],[42,4,42,6],[43,1,43,2],[43,4,43,6],[39,1,39,2],[39,4,39,6],[40,1,40,2],[40,4,40,6],[45,7,45,9],[46,7,46,9],[47,7,47,9],[45,1,45,2],[45,4,45,6],[46,1,46,2],[46,4,46,6],[42,7,42,9],[43,7,43,9],[44,7,44,9],[44,1,44,2],[44,4,44,6],[47,1,47,2],[47,4,47,6],[55,7,55,9],[51,7,51,9],[52,7,52,9],[53,7,53,9],[51,1,51,2],[51,4,51,6],[52,1,52,2],[52,4,52,6],[48,7,48,9],[49,7,49,9],[50,7,50,9],[50,1,50,2],[50,4,50,6],[54,7,54,9],[53,1,53,2],[53,4,53,6],[54,1,54,2],[54,4,54,6],[55,1,55,2],[55,4,55,6],[48,1,48,2],[48,4,48,6],[49,1,49,2],[49,4,49,6],[37,7,37,9],[38,7,38,9],[37,1,37,2],[37,4,37,6],[38,1,38,2],[38,4,38,6],[33,7,33,9],[30,7,30,9],[31,7,31,9],[33,1,33,2],[33,4,33,6],[30,1,30,2],[30,4,30,6],[36,7,36,9],[35,1,35,2],[35,4,35,6],[36,1,36,2],[36,4,36,6],[31,1,31,2],[31,4,31,6],[34,1,34,2],[34,4,34,6],[29,7,29,9],[32,7,32,9],[32,1,32,2],[32,4,32,6],[26,6,26,9],[27,1,27,9],[28,7,28,9],[35,7,35,9],[18,1,26,2],[18,3,26,4],[18,6,18,9],[19,6,19,9],[20,6,20,9],[21,6,21,9],[22,6,22,9],[23,6,23,9],[24,5,24,9],[25,6,25,9],[34,7,34,9],[28,1,28,2],[28,4,28,6],[29,1,29,2],[29,4,29,6],[16,1,16,2],[16,3,16,4],[16,6,16,9],[17,1,17,2],[17,3,17,4],[17,6,17,9],[13,1,13,9],[14,1,14,4],[14,5,14,9],[15,1,15,2],[15,3,15,4],[15,6,15,9],[11,1,11,2],[11,3,11,4],[11,6,11,9],[12,1,12,2],[12,3,12,4],[12,6,12,9],[8,1,8,2],[8,3,8,9],[9,1,9,2],[9,3,9,4],[9,6,9,9],[10,1,10,2],[10,3,10,4],[10,6,10,9],[5,1,5,2],[5,3,5,5],[5,7,5,9],[6,1,6,2],[6,3,6,9],[7,1,7,2],[7,3,7,9],[1,1,2,5],[1,6,1,9],[2,7,2,9],[3,1,3,9],[4,1,4,2],[4,3,4,9]]}
[]
[null,"PLANO DE ENSAIOS PARA CADEIRA DE ALIMENTAÇÃO PARA CRIANÇAS",null,null,null,null,"FOR.5.2.1"]
[null,null,null,null,null,null,"REV.00","2025-09-15"]
[null,"IDENTIFICAÇÃO DO SOLICITANTE"]
[null,"Razão Social: (Solicitante)",null,{"$f":"SOLICITAÇÃO!C9","v":"-"}]
[null,"Endereço: (Solicitante)",null,{"$f":"CONCATENATE(SOLICITAÇÃO!C12,\" - \",SOLICITAÇÃO!C13,\" - \",SOLICITAÇÃO!C15,\" - \",SOLICITAÇÃO!C16)","v":"- - - - - - -"},null,null,"CEP:",{"$f":"[1]SOLICITAÇÃO!C14","v":"-"}]
[null,"CNPJ: (Solicitante)",null,{"$f":"SOLICITAÇÃO!C11","v":"-"}]
[null,"Fabricante:",null,{"$f":"SOLICITAÇÃO!C25","v":"-"}]
[null,"Portaria:",null,"PORTARIA Nº 168, DE 14 DE ABRIL DE 2021 - Aprova o Regulamento Técnico da Qualidade e os Requisitos de Avaliação da Conformidade para\nCadeiras de Alimentação Para Crianças – Consolidado."]
[null,"Rastreabilidade da amostra:",null,null,null,"Quantidade de amostras:"]
[null,"Modelo de certificação:",null,{"$f":"SOLICITAÇÃO!C5","v":"-"},null,"Tipo de amostra:","ESCOLHER UM ITEM."]
[null,"Tipo Amostragem:",null,"Escolher um item.",null,"Processo: (Evento)"]
[null,"Técnico responsável:",null,null,null,"Data:"]
[null,"IDENTIFICAÇÃO DA AMOSTRA"]
[null,"Identificação do modelo ",null,null,null,"Características construtivas"]
[null,"Modelo:",null,{"$f":"'MEMORIAL DESCRITIVO'!F3","v":"-"},null,"Tipo de cadeira:",{"$f":"'MEMORIAL DESCRITIVO'!G41:J41","v":"-"}]
[null,"Marca:",null,{"$f":"'MEMORIAL DESCRITIVO'!F4","v":"-"},null,"Capacidade de carga:",{"$f":"'MEMORIAL DESCRITIVO'!G42:J42","v":"-"}]
[null,"Nome comercial:",null,{"$f":"'MEMORIAL DESCRITIVO'!F5","v":"-"},null,"Material da estrutura:",{"$f":"'MEMORIAL DESCRITIVO'!G43:J43","v":"-"}]
[null,"Foto do produto:",null,null,null,"Material do tecido:",{"$f":"'MEMORIAL DESCRITIVO'!G44:J44","v":"-"}]
[null,null,null,null,null,"Dimensões:",{"$f":"'MEMORIAL DESCRITIVO'!G45:J45","v":"-"}]
[null,null,null,null,null,"Processo de fabricação:",{"$f":"'MEMORIAL DESCRITIVO'!G46:J46","v":"-"}]
[null,null,null,null,null,"Dispositivo de travamento:",{"$f":"IF('MEMORIAL DESCRITIVO'!G47=\"Outros:\",'MEMORIAL DESCRITIVO'!J47,'MEMORIAL DESCRITIVO'!G47)","v":"-"}]
[null,null,null,null,null,"Tipo de base:",{"$f":"IF('MEMORIAL DESCRITIVO'!G48=\"Outros:\",'MEMORIAL DESCRITIVO'!J48,'MEMORIAL DESCRITIVO'!G48)","v":"-"}]
[null,null,null,null,null,"Dispositivo de retenção:",{"$f":"IF('MEMORIAL DESCRITIVO'!G49=\"Outros:\",'MEMORIAL DESCRITIVO'!J49,'MEMORIAL DESCRITIVO'!G49)","v":"-"}]
[null,null,null,null,null,"Acessórios:"]
[null,null,null,null,null,"Contidos na embalagem:",{"$f":"_xlfn.TEXTJOIN(\" / \", TRUE,\n    IF('MEMORIAL DESCRITIVO'!D53<>\"\",'MEMORIAL DESCRITIVO'!D53,\"\"),\n    IF('MEMORIAL DESCRITIVO'!D54<>\"\",'MEMORIAL DESCRITIVO'!D54,\"\"),\n    IF('MEMORIAL DESCRITIVO'!D55<>\"\",'MEMORIAL DESCRITIVO'!D55,\"\"),\n    IF('MEMORIAL DESCRITIVO'!D56<>\"\",'MEMORIAL DESCRITIVO'!D56,\"\")\n)","v":""}]
[null,null,null,null,null,"Vendidos separadamente:",{"$f":"_xlfn.TEXTJOIN(\" / \", TRUE,\n    IF('MEMORIAL DESCRITIVO'!J53<>\"\",'MEMORIAL DESCRITIVO'!J53,\"\"),\n    IF('MEMORIAL DESCRITIVO'!J54<>\"\",'MEMORIAL DESCRITIVO'!J54,\"\"),\n    IF('MEMORIAL DESCRITIVO'!J55<>\"\",'MEMORIAL DESCRITIVO'!J55,\"\"),\n    IF('MEMORIAL DESCRITIVO'!J56<>\"\",'MEMORIAL DESCRITIVO'!J56,\"\")\n)","v":""}]
[null,"Tabela 1: Definição dos ensaios, inspeções visuais e/ou medições a serem realizados"]
[null,"Requisito do RTQ",null,"Portaria","Descrição",null,null,"Execução?"]
[null,"Item 3.1",null,"PORTARIA INMETRO Nº 168/2021","Inspeção visual dos materiais",null,null,"Escolher um item."]
{"$rows_left_out":27}
{"sheet":"PLANO DE ENSAIO (Cadeira Alta)","index":4,"n_rows":54,"n_cols":8,"rows_kept":54,"cut":false,"hidden":true,"merged":[[28,1,28,2],[36,1,36,2],[37,1,37,2],[38,1,38,2],[39,1,39,2],[40,1,40,2],[41,1,41,2],[42,1,42,2],[43,1,43,2],[29,1,29,2],[30,1,30,2],[31,1,31,2],[32,1,32,2],[33,1,33,2],[34,1,34,2],[35,1,35,2],[41,4,41,6],[42,4,42,6],[43,4,43,6],[53,1,53,2],[45,1,45,2],[46,1,46,2],[47,1,47,2],[48,1,48,2],[49,1,49,2],[50,1,50,2],[44,1,44,2],[51,1,51,2],[52,1,52,2],[38,4,38,6],[35,7,35,9],[32,7,32,9],[33,7,33,9],[34,7,34,9],[32,4,32,6],[33,4,33,6],[29,7,29,9],[30,7,30,9],[31,7,31,9],[31,4,31,6],[34,4,34,6],[35,4,35,6],[29,4,29,6],[30,4,30,6],[51,7,51,9],[52,7,52,9],[53,7,53,9],[51,4,51,6],[52,4,52,6],[48,7,48,9],[49,7,49,9],[50,7,50,9],[50,4,50,6],[53,4,53,6],[48,4,48,6],[49,4,49,6],[45,7,45,9],[46,7,46,9],[47,7,47,9],[45,4,45,6],[46,4,46,6],[42,7,42,9],[43,7,43,9],[44,7,44,9],[44,4,44,6],[47,4,47,6],[39,7,39,9],[40,7,40,9],[41,7,41,9],[39,4,39,6],[40,4,40,6],[36,7,36,9],[37,7,37,9],[38,7,38,9],[26,6,26,9],[27,1,27,9],[28,7,28,9],[18,1,26,2],[18,3,26,4],[18,6,18,9],[19,6,19,9],[20,6,20,9],[21,6,21,9],[22,6,22,9],[23,6,23,9],[24,5,24,9],[25,6,25,9],[28,4,28,6],[36,4,36,6],[37,4,37,6],[16,1,16,2],[16,3,16,4],[16,6,16,9],[17,1,17,2],[17,3,17,4],[17,6,17,9],[13,1,13,9],[14,1,14,4],[14,5,14,9],[15,1,15,2],[15,3,15,4],[15,6,15,9],[11,1,11,2],[11,3,11,4],[11,6,11,9],[12,1,12,2],[12,3,12,4],[12,6,12,9],[8,1,8,2],[8,3,8,9],[9,1,9,2],[9,3,9,4],[9,6,9,9],[10,1,10,2],[10,3,10,4],[10,6,10,9],[5,1,5,2],[5,3,5,5],[5,7,5,9],[6,1,6,2],[6,3,6,9],[7,1,7,2],[7,3,7,9],[1,1,2,5],[1,6,1,9],[2,7,2,9],[3,1,3,9],[4,1,4,2],[4,3,4,9]]}
[]
[null,"PLANO DE ENSAIOS PARA CADEIRA DE ALIMENTAÇÃO PARA CRIANÇAS",null,null,null,null,"FOR.5.2.2"]
[null,null,null,null,null,null,"REV.00","2025-09-15"]
[null,"IDENTIFICAÇÃO DO SOLICITANTE"]
[null,"Razão Social: (Solicitante)",null,{"$f":"SOLICITAÇÃO!C9","v":"-"}]
[null,"Endereço: (Solicitante)",null,{"$f":"CONCATENATE(SOLICITAÇÃO!C12,\" - \",SOLICITAÇÃO!C13,\" - \",SOLICITAÇÃO!C15,\" - \",SOLICITAÇÃO!C16)","v":"- - - - - - -"},null,null,"CEP:",{"$f":"[1]SOLICITAÇÃO!C14","v":"-"}]
[null,"CNPJ: (Solicitante)",null,{"$f":"SOLICITAÇÃO!C11","v":"-"}]
[null,"Fabricante:",null,{"$f":"SOLICITAÇÃO!C25","v":"-"}]
[null,"Portaria:",null,"PORTARIA Nº 168, DE 14 DE ABRIL DE 2021 - Aprova o Regulamento Técnico da Qualidade e os Requisitos de Avaliação da Conformidade para\nCadeiras de Alimentação Para Crianças – Consolidado."]
[null,"Rastreabilidade da amostra:",null,null,null,"Quantidade de amostras:"]
[null,"Modelo de certificação:",null,{"$f":"SOLICITAÇÃO!C5","v":"-"},null,"Tipo de amostra:","ESCOLHER UM ITEM."]
[null,"Tipo Amostragem:",null,"Escolher um item.",null,"Processo: (Evento)"]
[null,"Técnico responsável:",null,null,null,"Data:"]
[null,"IDENTIFICAÇÃO DA AMOSTRA"]
[null,"Identificação do modelo ",null,null,null,"Características construtivas"]
[null,"Modelo:",null,{"$f":"'MEMORIAL DESCRITIVO'!F3","v":"-"},null,"Tipo de cadeira:",{"$f":"'MEMORIAL DESCRITIVO'!G41:J41","v":"-"}]
[null,"Marca:",null,{"$f":"'MEMORIAL DESCRITIVO'!F4","v":"-"},null,"Capacidade de carga:",{"$f":"'MEMORIAL DESCRITIVO'!G42:J42","v":"-"}]
[null,"Nome comercial:",null,{"$f":"'MEMORIAL DESCRITIVO'!F5","v":"-"},null,"Material da estrutura:",{"$f":"'MEMORIAL DESCRITIVO'!G43:J43","v":"-"}]
[null,"Foto do produto:",null,null,null,"Material do tecido:",{"$f":"'MEMORIAL DESCRITIVO'!G44:J44","v":"-"}]
[null,null,null,null,null,"Dimensões:",{"$f":"'MEMORIAL DESCRITIVO'!G45:J45","v":"-"}]
[null,null,null,null,null,"Processo de fabricação:",{"$f":"'MEMORIAL DESCRITIVO'!G46:J46","v":"-"}]
[null,null,null,null,null,"Dispositivo de travamento:",{"$f":"IF('MEMORIAL DESCRITIVO'!G47=\"Outros:\",'MEMORIAL DESCRITIVO'!J47,'MEMORIAL DESCRITIVO'!G47)","v":"-"}]
[null,null,null,null,null,"Tipo de base:",{"$f":"IF('MEMORIAL DESCRITIVO'!G48=\"Outros:\",'MEMORIAL DESCRITIVO'!J48,'MEMORIAL DESCRITIVO'!G48)","v":"-"}]
[null,null,null,null,null,"Dispositivo de retenção:",{"$f":"IF('MEMORIAL DESCRITIVO'!G49=\"Outros:\",'MEMORIAL DESCRITIVO'!J49,'MEMORIAL DESCRITIVO'!G49)","v":"-"}]
[null,null,null,null,null,"Acessórios:"]
[null,null,null,null,null,"Contidos na embalagem:",{"$f":"_xlfn.TEXTJOIN(\" / \", TRUE,\n    IF('MEMORIAL DESCRITIVO'!D53<>\"\",'MEMORIAL DESCRITIVO'!D53,\"\"),\n    IF('MEMORIAL DESCRITIVO'!D54<>\"\",'MEMORIAL DESCRITIVO'!D54,\"\"),\n    IF('MEMORIAL DESCRITIVO'!D55<>\"\",'MEMORIAL DESCRITIVO'!D55,\"\"),\n    IF('MEMORIAL DESCRITIVO'!D56<>\"\",'MEMORIAL DESCRITIVO'!D56,\"\")\n)","v":""}]
[null,null,null,null,null,"Vendidos separadamente:",{"$f":"_xlfn.TEXTJOIN(\" / \", TRUE,\n    IF('MEMORIAL DESCRITIVO'!J53<>\"\",'MEMORIAL DESCRITIVO'!J53,\"\"),\n    IF('MEMORIAL DESCRITIVO'!J54<>\"\",'MEMORIAL DESCRITIVO'!J54,\"\"),\n    IF('MEMORIAL DESCRITIVO'!J55<>\"\",'MEMORIAL DESCRITIVO'!J55,\"\"),\n    IF('MEMORIAL DESCRITIVO'!J56<>\"\",'MEMORIAL DESCRITIVO'!J56,\"\")\n)","v":""}]
[null,"Tabela 1: Ensaios e itens de verificação a serem realizados em carrinhos para crianças"]
[null,"Requisito do RTQ",null,"Portaria","Descrição",null,null,"Execução?"]
[null,"Item 5",null,"PORTARIA INMETRO Nº 168/2021","Requisitos de marcações e informações obrigatórias no produto e na embalagem.",null,null,"Escolher um item."]
{"$rows_left_out":25}
{"sheet":"REPASSE ","index":5,"n_rows":28,"n_cols":3,"rows_kept":28,"cut":false,"hidden":true,"merged":[[27,1,31,1],[27,2,31,4],[9,2,9,4],[10,2,10,4],[11,2,11,4],[12,2,12,4],[13,2,13,4],[14,2,14,4],[15,2,15,4],[16,2,16,4],[18,2,18,4],[19,2,19,4],[21,2,21,4],[8,2,8,4],[1,1,1,4],[3,1,3,4],[5,2,5,4],[6,2,6,4],[7,2,7,4]]}
[]
[null,"                                \n                    REPASSE - CAC\n                 \n                               "]
[]
[null,"DADOS DO EMBALADOR - (Somente em caso de repasse)"]
[]
[null,"RAZÃO SOCIAL:","-"]
[null,"NOME FANTASIA:","-"]
[null,"CNPJ:","-"]
[null,"ENDEREÇO:","-"]
[null,"BAIRRO:","-"]
[null,"CEP:","-"]
[null,"CIDADE:","-"]
[null,"ESTADO:","-"]
[null,"E-MAIL:","-"]
[null,"NOME DO CONTATO:","-"]
[null,"TELEFONE: (   )","-"]
[null,"DATA DA SOLICITAÇÃO:","-"]
[]
[null,"N° AUTORIZAÇÃO PARTICULAR DE REPASSE:","-"]
[null,"N° AUTORIZAÇÃO DE USO DA MARCA:","-"]
[]
[null,"N° DE LICENÇA DE IMPORTAÇÃO:","-"]
[]
[null,"PROCEDÊNCIA: ","-"]
[null,{"$f":"IF(C24=\"IMPORTADO\",\"PAÍS DE ORIGEM:\",\"\")","v":""},"-"]
[null,{"$f":"IF(C24=\"IMPORTADO\",\"N° DA LICENÇA DE IMPORTAÇÃO\",\"-\")","v":"-"},"-"]
[]
[null,null,"______________________________________________________________________\nAssinatura (obrigatório)\n"]